{"text_format":"1","workbook":"xlsx","n_sheets":7,"sheets":["Quick Help","Revision History","Announcement","CodeCollab","CommentsSheet","Allowed Values","Sheet1"],"not_rendered":{"charts":0,"images":0,"macros":1,"external_links":1,"defined_names":15,"comments":2,"pivot_tables":0},"unopened":[],"bounds":{"document_bytes":16777216,"sheet_cells":100000,"rows_first":2000,"rows_last":500,"rows_between":2000,"halvings":0,"cell_chars":16384,"cell_head_chars":4096},"cells_cut":0,"cells_raw":0,"read":"whole","date_system":"1900"}

{"sheet":"Quick Help","index":0,"n_rows":26,"n_cols":2,"rows_kept":26,"cut":false,"hidden":true,"merged":[]}
["GPS III Peer Review Quick Help"]
[]
["The GPS III Peer Review Form consists of 4 worksheets:"]
["1.","This Quick Help guide"]
["2.","The Announcement sheet which is used to define not only the peer review session, \nbut also the work product being rviewed.  Many of the fields are used to categorize the results of the session and track the quality level of the work product and the effectiveness of the review."]
["3.","The CommentsSheet is used to record any problems you encounter while reviewing the work product.  Your comments will be combined with the other reviewer's prior to the peer review meeting.  The author will use this same form to track rework and closure of each fnding."]
["4.","Allowed Values is a hidden worksheet that drives all of the pull-down fields and content validation on the forms.  DO NOT change anything on this sheet.  If you need to have a different field option than what is supplied, please contact your CM Manager."]
[]
["Initialization"]
["u","Always go back to the master Peer Review folder on the WGC to get a new peer Review form.  At times the allowed values or the macros may be updated; and you will miss these upgrades if you keep a local copy."]
["u","Check the Peer review Log file for the next available Peer Review ID.  Reserve the log and sign-up for the numbers you need."]
["u","The syntax for your Peer Review ID is CC-EEE-9999, where:\nCC    = company (LM,GD,IT)\nEEE  = Element (GPS,ANT,BUS,COM,NAV,DBS,SIM) , and\n9999 = one up number from the log."]
[]
["Macro Buttons"]
[null,"PLEASE ensure that you use the macro buttons to Add new rows to the Announcement Sheet.  This will ensure that all formatting is copied correctly and that the embedded equations are not corrupted."]
[]
["Syntax of the Form"]
["The form consists of mandatory and optional fields."]
[null,"Each mandatory field is identified with a * Label that appears in red with an asterisk."]
["Cell backgrounds:"]
{"$rows_left_out":7}
{"sheet":"Revision History","index":1,"n_rows":32,"n_cols":3,"rows_kept":32,"cut":false,"hidden":true,"merged":[]}
["Date","Change"]
[20080101,"Initial release"]
[20080130,"Modified data validation settings on review date fields to be \"Any Value\" with cell format of dd-mmm-yy"]
[null,"Corrected Added a mising : to Col_M exception handler in Consolidate Comments macro"]
[null,"Goto Col_E exception should have been Col_G in the consolidate macro"]
[null,"Corrected various typos in Comments"]
[20080204,"Announcement: changed manager/tech Lead to \"Technical Lead\" and mage role optional"]
[20080207,"Changed SSSI to SSIS"]
[null,"Added values to IPT list: PMO, LOS, HPE, Customer"]
[null,"Added \"Yes - TBx\" as a closure code"]
[20080212,"Corrected macro to put reviewer's name in description cell - off by 1 column…"]
[20080220,"Added missing criteria to compute Save/Escapes"]
[20080304,"Corrected pulldowns for Defect/Reco/Action - added Trivial"]
[null,"deleted Trivial from Escape/Save cell"]
[null,"added a commetn to Defect/reco header"]
[null,"added a little more conditional formatting colo0rs"]
[null,"added Yes - TBx as an accept change field"]
[20080319,"Corrected the Add macroo's calculation of total participants"]
[20080529,"corrected count equation for number of ITRs, number of sessions"]
[null,"corrected conditional formatting on material Available field"]
{"$rows_left_out":13}
{"sheet":"Announcement","index":2,"n_rows":74,"n_cols":60,"rows_kept":74,"cut":false,"hidden":false,"merged":[[9,1,9,2],[11,1,11,2],[44,1,44,2],[11,6,11,7],[43,1,43,2],[15,2,15,8],[18,1,18,3],[39,0,39,8],[42,1,42,2],[14,2,14,8],[2,0,2,8],[5,0,5,8],[49,1,49,2],[50,1,50,2],[19,1,19,3],[27,0,27,8],[7,6,7,7],[8,6,8,7],[12,1,12,8],[4,1,4,2],[7,1,7,2],[8,1,8,2],[16,2,16,8],[9,6,9,7],[45,1,45,2],[46,1,46,2],[72,0,72,8],[70,2,70,8],[47,1,47,2],[48,1,48,2],[51,1,51,2],[62,0,62,8],[64,1,64,2],[60,1,60,3],[57,1,57,3],[59,1,59,3],[58,1,58,3],[56,1,56,3],[52,1,52,2]]}
["Review Type ","* Meeting Type ","Review Disposition ","* Review ID ","* Review Title ","If Re-Review, Original Review ID ","* Program Team ","* Element ","* Upcoming Milestone ",null,"* Block "," * Product CM ID ","* Product Type ","Units: ","Pages: New","Pages: Mod","Pages: Reuse","Pages: Autogen","Diagrams: New","Diagrams: Mod","Diagrams: Reuse","Diagrams: Autogen","Req: New","Req: Mod","Req: Reuse","Req: Autogen","SLOC: New","SLOC: Mod","SLOC: Reuse","SLOC: Autogen","Number ITRs ","Days Available ","Material Available","* Review Session 1 ","Number of Review Sessions","Duration","Manager / Tech Lead","Moderator","Author","Recorder","Total Planned Prep Hours","Total Actual Prep Hours","Number People Prep","Total Time in Meeting","Total Peopl Attended","Rework Hours","verification Hours","Defects reported","Defects Opened","Defects Fixed","Defects Verified","Recos reported","Recos Opened","Recos Fixed","Recos Verified","Saves","Escapes","Record Locked","Closure Date","Days to Close"]
[{"$f":"B5","v":"Peer Review"},{"$f":"B8","v":"Initial"},{"$f":"B65","v":"Accept"},{"$f":"B12","v":"IT-NAV-2951"},{"$f":"B13","v":"TSW SIQT Dry Run Test Results Review  - TC1 - TC 5"},{"$f":"G12","v":0},{"$f":"B9","v":"SV-Nav"},{"$f":"B10","v":"Navigation"},{"$f":"G8","v":"TRR"},{"$f":"G9","v":"SIQT"},{"$f":"G10","v":"IIIA"},{"$f":"B19","v":"STD1620155 - Appen. 7 TP Clear Case Label "},{"$f":"B20","v":"Software Test Description (STD)"},{"$f":"F20","v":"Pages/Diagrams"},{"$f":"B23","v":" "},{"$f":"C23","v":"N/A"},{"$f":"D23","v":"N/A"},{"$f":"E23","v":"N/A"},{"$f":"B24","v":"N/A"},{"$f":"C24","v":"N/A"},{"$f":"D24","v":"N/A"},{"$f":"E24","v":"N/A"},{"$f":"B25","v":"N/A"},{"$f":"C25","v":"N/A"},{"$f":"D25","v":"N/A"},{"$f":"E25","v":"N/A"},{"$f":"B26","v":"N/A"},{"$f":"C26","v":"N/A"},{"$f":"D26","v":"N/A"},{"$f":"E26","v":"N/A"},{"$f":"E31","v":1},{"$f":"E33","v":0},{"$f":"B33","v":"00:00:00"},{"$f":"B36","v":"00:00:00"},{"$f":"D55","v":0},{"$f":"H38","v":0},{"$f":"B44","v":"Roger Masotti"},{"$f":"B45","v":"Ken Adam"},{"$f":"B46","v":"Multiple"},{"$f":"B47","v":"Simone Melnick"},{"$f":"G54","v":0},{"$f":"H54","v":0},{"$f":"H55","v":0},{"$f":"I54","v":0},{"$f":"I55","v":0},{"$f":"C68","v":200},{"$f":"C69","v":40},{"$f":"CommentsSheet!G2","v":0},{"$f":"CommentsSheet!G3","v":0},{"$f":"CommentsSheet!G4","v":0},{"$f":"CommentsSheet!G5","v":0},{"$f":"CommentsSheet!H2","v":0},{"$f":"CommentsSheet!H3","v":0},{"$f":"CommentsSheet!H4","v":0},{"$f":"CommentsSheet!H5","v":0},{"$f":"CommentsSheet!J4","v":0},{"$f":"CommentsSheet!J5","v":0},{"$f":"IF(C2=\"\",\"\",IF(OR(C2=\"Accept\",C2=\"Conditional\"),\"Locked\",\"\"))","v":"Locked"},{"$f":"IF(E69=\"\",\"\",E69)","v":""},{"$f":"IF(BG2=\"\",\"\",BG2-AH2)","v":""}]
["< Insert Classification Banner Here >"]
[null,null,"GPS III PEER REVIEW REPORT",null,null,null,null,null,20100112]
["Review Type ","Peer Review"]
["GENERAL INFORMATION"]
[]
["* Meeting Type ","Initial",null,null,null,"* Upcoming Milestone ","TRR"]
["* Program Team ","SV-Nav",null,null,null,"* Development Phase ","SIQT"]
["* Element ","Navigation",null,null,null,"* Block ","IIIA"]
[]
["* Review ID ","IT-NAV-2951",null,null,null,"If Re-Review, Original Review ID "]
["* Review Title ","TSW SIQT Dry Run Test Results Review  - TC1 - TC 5"]
[]
[null,"* Location of Review Materials "]
[null,"Reference Materials ","B030 Software Test Description - Appendix 7 - TSW SIQT Test Procedures "]
[null,"* Product Checklist ","None"]
[]
[" * Product CM ID ","STD1620155 - Appen. 7 TP Clear Case Label "]
["* Product Type ","Software Test Description (STD)",null,null,"Units: ",{"$f":"VLOOKUP(B20,'Allowed Values'!N:P,3,FALSE)","v":"Pages/Diagrams"}]
{"$rows_left_out":55}
{"sheet":"CodeCollab","index":3,"n_rows":0,"n_cols":0,"rows_kept":0,"cut":false,"hidden":true,"merged":[]}

{"sheet":"CommentsSheet","index":4,"n_rows":64,"n_cols":18,"rows_kept":64,"cut":false,"hidden":false,"merged":[[6,0,6,5],[6,9,6,12]]}
[null,null,null,"GPS III PEER REVIEW COMMENTS",null,null,"Defects","Recos",null,null,null,null,null,null,{"$f":"IF(ISERROR(CodeCollab!A1),0,COUNTIF(CodeCollab!A:H,\"Save\"))","v":0},{"$f":"IF(ISERROR(CodeCollab!A1),0,COUNTIF(CodeCollab!A:H,\"Escape\"))","v":0},{"$f":"IF(ISERROR(CodeCollab!A1),0,COUNTIF(CodeCollab!A:H,\"Trivial\"))","v":0}]
[null,null,null,null,null,"Reported:",{"$f":"DCOUNTA($G$8:$G1034,1,$P$2:$P$3) +O1+P1","v":0},{"$f":"DCOUNTA($G$8:$G1034,1,$P$6:$P$7)+Q1","v":0},null,null,null,null,null,null,"Defect\nResolved",{"$f":"G8","v":"Defect /\nReco /\nAction /\nTrivial"},"Agree to Change ","Implemented Solution"]
[null,null,"Review ID ",{"$f":"IF(Announcement!B12=\"\",\"\",Announcement!B12)","v":"IT-NAV-2951"},null,"TOTALS:     Opened:",{"$f":"DCOUNTA($G$8:$H$1034,1,$P$2:$Q$4)+O1+P1","v":0},{"$f":"DCOUNTA($G$8:$H$1034,1,$P$6:$Q$8)+Q1","v":0},null,null,null,null,null,null,"Yes","Defect","Yes - Fix","<>"]
[null,null,"* Reviewer's Name ",null,null,"Fixed:",{"$f":"DCOUNTA($G$8:$I$1034,1,$P$2:$R$4)+O1+P1","v":0},{"$f":"DCOUNTA($G$8:$I$1034,1,$P$6:$R$8)+Q1","v":0},"   Saves ",{"$f":"DCOUNTA($J$8:$J$1034,1,$O$10:$O$32)+O1","v":0},null,null,null,null,"Yes","Defect","Yes - DR","<>"]
[null,null,"* Reviewer's Phone ",null,null,"Verified:",{"$f":"DCOUNTA($G$8:$N$1034,1,$O$2:$R$4)+O1+P1","v":0},{"$f":"DCOUNTA($G$8:$N$1034,1,$O$6:$R$8)+Q1","v":0},"   Escapes ",{"$f":"DCOUNTA($J$8:$J$1034,1,$P$10:$P$32)+P1","v":0}]
[null,null,null,null,null,null,null,null,null,null,null,null,null,null,"Defect\nResolved",{"$f":"P2","v":"Defect /\nReco /\nAction /\nTrivial"},"Agree to Change ","Implemented Solution"]
["Reviewer's Comments",null,null,null,null,null,null,null,"Author Only","Categorization",null,null,null,"Moderator","Yes","Reco","Yes - Fix","<>"]
["Item #","Location in Product\n\nPrimary","Secondary","Comment","Original Text\n(optional)","Recommended Resolution\n (optional)","Defect /\nReco /\nAction /\nTrivial","Agree to Change ","Implemented Solution","Save/\nEscape","If Escape,\nPHASE defect was introduced","If Escape,\nPRODUCT defect was introduced","Causal \nCode","Defect\nResolved","Yes","Reco","Yes - DR","<>"]
[1,"7.1.1.1.5",null,"(JT) Concerns Carried Over From SWIT (Not Completely Answered in Reference File):\nTC01, 7.1.1.1.5 \nRegarding the verification of NPE_TSW_SRS-2736\nThe NPE TSW shall perform a state-of-health test to assure that the entire system is ready for test by verifying communication interfaces and local disk storage space.\nIt is not clear how the above requirement gets verified with checking the “LBCRHeartbeat” message in a GUI window.  There are probably many more state-of-health checks that are needed to assure that the entire system is ready for test.\n",null,"Requirement was re worded with Customers sanction.Test procedures should be sufficient as is. Waiting for RIGOR report from Customer."]
[2,"7.1.1.1.5",null,"(JT) Concerns Carried Over From SWIT (Not Completely Answered in Reference File):\nTC01, 7.1.1.1.5 \nRegarding the verification of NPE_TSW_SRS-1341:\nThe NPE TSW shall record all current revision information for all test scripts, TSW SI software current revision information, MDU flight software current revision information, with all test results.\nIt is not clear where the NPE TSW records all revision information for all test scripts, all TSW SI software current revision information, along with all test results.\nThere is a report (ScriptResults____.xls) that contains the MDU flight software current revision information only.  However, it is not clear where the NPE TSW records the other information per NPE_TSW_SRS-1341:\no all current revision information for all test scripts\no all TSW SI software current revision information\no all test results (including status such as whether test case or subcase completed, passed, failed, was aborted, etc.)\n",null,"All current revision information for all test scripts. These are stored in ClearCase. Should we delete this wording from the requirement? All TSW SI software current revision information. This is available through the TEE GUI. As well, on the LBCR you can run the “GET_SIRN” command. All test results (including status such as whether test case or subcase completed, passed, failed, was aborted, etc.)These are in the database.",null,null,null,null,null,null,null,null,"Save/\nEscape","Save/\nEscape"]
[3,"7.1.1.1",null,"(AC) Initial Setup - Confirm TSW Desktop Shortcuts: \nThis section produced  no data file. This reviewer witnessed  the test on 1-21-14, and on step 15, DR 3467 was written against the test procedure due to the installation fialed to start the engine as the WATLOW did not start. WATLOW is a thermal controller",null,"DR 3467 Still being adressed - \"In Work\""]
[4,"7.1.1.2",null,"(AC) - Confirm TSW Desktop Shortcuts:\nThis section produced  no data file. This reviewer witnessed  the test on 1-21-14, and on step 24, it failed to have the util TLM_Dashboard.exe (a Cat4 tool) being installed into the appropriate folder. Hence, it failed on creating the short cut for it. This tool is needed for check out the 1553 box.",null,"TLM Dashboard in C:\\Documents and Settings\\All Users\\Application Data\\ITT\\GPSIII\\Utility\\TLM_Dashboard currently exists, and can create shortcut. Does installer copy file from ClearCase Dir …\\Mite\\07_Integration_Testing\\Files\\GPSIII CAT4 Tools\\TLM Dashboard "]
[5,"7.1.1.2",null,"(AC) - Confirm TSW Desktop Shortcuts:\nThe second issue for this short cut failure in step 24 was that this TLM_Dashboard.exe was not packaged into the Util SIRN in the clearcase. Need SCM to bring in the official released SIRN items.  It was declared as not staged correctly.",null,"Need to confirm that Clearcase SIRN copy of Dashboard installs correctly and in proper location. Follow up with James."]
[6,"7.1.1.3",null,"(AC) Confirm SQL Server Management Studio is available on PC:\n This section produced  no data file. This reviewer witnessed  the test on 1-21-14. All steps under this section were fine.",null,"SQL Server Management Studio is installed on PC. Need to Discuss what artifacts or procedure needed for verifying."]
[7,"7.1.1.4",null,"(AC) Power On and Configuration Verification:\nPage 1 of the screen shot showed the SQL Querry12.sql, and page 2 has SQLQerry13.sql_MITE_CTR_1. The data base querry looked fine.",null,"Were Screeshots taken to update screen capture figure database?"]
[8,"7.1.1.5",null,"(AC) Record SIRN ID for the TSW being used for TSW SIQT:\nNo error, no warning, no incomplete found in any of these files",null,"SIRN ID was found by starting Test Executive. No scripts were ran. No report files generated"]
[9,"7.1.1.6",null,"(AC) Record and Confirm Test Directory (root) established for SIQT.\nThis section prodcued no data file for review.",null,"No Data is generated because no scripts are run. Directorys are created for proper file paths to copy to."]
[10,"7.1.1.7",null,"(AC) Configure MDU and STE to a \"Nominal\" operational state.\nThe two script result files, ITT_Debugg_ITE.log  and the XTSHistory were okay. Lines 9350-9356 in the file ITT_Debugging_MAR.log showed an INFO message that : ITT_Specific MDU 1553_MDU Normal TLM Bus Transaction Failure, status = DataNoResponse Error. Another message on line 10015: INFO ITT::SSD::Test Equipment::DI.USB DioBase::WriteChannel = Data = False",null,"Issue occurred while MDU was in shutdown state. This is a normal event when MDU_Power_OnOFF is running and occurs when ran."]
[11,"7.1.1.8",null,"(AC) Optional: Used during testing to do a Soft Reset to the MDU.\nThis section was not executed during this dry run",null,"This script runns Utility_MDU_Initilization. Since Previously, Utility_MDU_PowerOnOFF was run for Off and ON configurations, then Utility_MDU__Configuration was then ran. Therefore it was agreed Unecessary to run MDU Reinitilization. There were LCBR issues encountered in previous test case. I don't know why skipping this testcase wasnt document or put in the log."]
[12,"7.1.1.9",null,"(AC) Optional: Use for Restoring STE to a Nominal Test Execution Working State.\nThe bit map image showed failure in starting the test twice. Failure due to \"Could not find the file\"  SID1 and SID2 ScriptResult files showed no start time, and no end time.",null,"XTSschema.xsd was not loaded from clearcase directory 07_Integration_Testing\\Schemas into the Scripts directory at software load. File now exists. Need to check install procedure and see if it's getting loaded. Follow up with James"]
{"$rows_left_out":45}
{"sheet":"Allowed Values","index":5,"n_rows":41,"n_cols":17,"rows_kept":41,"cut":false,"hidden":true,"merged":[]}
[{"$f":"COUNTA(A4:A100)","v":6},{"$f":"COUNTA(B4:B98)","v":4},{"$f":"COUNTA(C4:C106)","v":12},{"$f":"COUNTA(D4:D109)","v":15},{"$f":"COUNTA(E4:E99)","v":8},{"$f":"COUNTA(F5:F101)","v":10},null,{"$f":"COUNTA(H4:H112)","v":24},null,{"$f":"COUNTA(J4:J100)","v":4},{"$f":"COUNTA(K4:K100)","v":13},null,null,{"$f":"COUNTA(N4:N101)","v":38}]
["AV_Review_Type","AV_Meeting_Type","AV_Team","AV_Team","AV_Element","AV_Milestone",null,"AV_Process",null,"AV_Block","AV_Major_Prod",null,null,"AV_Product_Type"]
["Review Type","Meeting Type","Program_Team","IPT_Team","Element","SSC Phase","SSC Phase - full","Program Process","Program Phase - full","Block","Major Product Types","Sizes","Not Used","Minor Product Types","Mapping to \nMajor Product","Units","Help"]
["Select","Select","Select","AI&T","Select","Select","Select","Select","Select","Select","N/A","N/A","END","Select","Select","none"," "]
["Peer Review","Initial","AI&T","Bus Ops","All GPS III","SRR","System Requirements Review (SRR) (System Requirements)","Plan","Project Planning & Oversighr","IIIA","Architecture","Pages/Diagrams",null,"Architectural Views","Architecture",{"$f":"VLOOKUP(O5,K$4:L$16,2,0)","v":"Pages/Diagrams"},"New = new and modified work\nReuse = reuse from another program or increment\nAutogen = tool generated items / reports"]
["CCB","Second Try","Bus Ops","CE","Antenna","SDR","System Design Review (SDR) (System Design)","Envir","Establish environment","IIIB","Code","SLOC",null,"A-Spec","Requirements","Requirements","New = new and modified work\nReuse = reuse from another program or increment\nAutogen = tool generated items / reports"]
["ERB - GPS III ","Maintenance","CE","Customer","Bus","PDR","Preliminary Design Review (PDR) (Preliminary Design)","SRA","Systems Requirement Analysis","IIIC","Critical Methods","Pages/Diagrams",null,"Element Spec","Requirements","Requirements","New = new and modified work\nReuse = reuse from another program or increment\nAutogen = tool generated items / reports"]
["ERB - IPT level",null,"SEIT","HPE (Hosted Payloads Element)","Communication","CDR","Critical Design Review (CDR) (Detailed Design)","SD","System Design",null,"Hardware","Pages/Diagrams",null,"ICD Specification","Requirements","Requirements","New = new and modified work\nReuse = reuse from another program or increment\nAutogen = tool generated items / reports"]
["SCCB",null,"SSIS","LOS (Launch Ops Support)","Navigation","TRR","Test Readiness Review (TRR) (Assembly and Integration)","SWRA","Software Requirements Analysis",null,"Documentation","Pages/Diagrams",null,"Sub-system Spec","Requirements","Requirements","New = new and modified work\nReuse = reuse from another program or increment\nAutogen = tool generated items / reports"]
[null,null,"SV-All areas","PMO","Data & GDBS","FCA"," Functional Configuration Audit (FCA) (Verification)","HWRA","Hardware Requirements Analysis",null,"Requirements","Requirements",null,"Software Requirements Specification (SRS)","Requirements","Requirements","New = new and modified work\nReuse = reuse from another program or increment\nAutogen = tool generated items / reports"]
[null,null,"SV-Antenna","SEIT","Simulators","IOC"," Initial Operating Capability (IOC) (Deployment)","SWD","Softwre Design",null,"SW Design","Pages/Diagrams",null,"Code","Code","SLOC","New = new and modified work\nReuse = reuse from another program or increment\nAutogen = tool generated items / reports"]
[null,null,"SV-Bus","SSIS",null,"Ops","End of Operational Program (Operations and Support)","HWD","Hardware Design",null,"Test Plans","Pages/Diagrams",null,"COTS","N/A","N/A","New = new and modified work\nReuse = reuse from another program or increment\nAutogen = tool generated items / reports"]
[null,null,"SV-Comm","SV",null,"Disp","Disposal (Program Closeout)","IUT","Implementation & Unit Test",null,"Test Procedures","Pages/Diagrams",null,"Critical Methods","Critical Methods","Pages/Diagrams","New = new and modified work\nReuse = reuse from another program or increment\nAutogen = tool generated items / reports"]
[null,null,"SV-Nav","SV-Antenna",null,null,null,"SIQT","Software item Qualification testing",null,"Test Results","SLOC",null,"ICD Drawings","Documentation","Pages/Diagrams","New = new and modified work\nReuse = reuse from another program or increment\nAutogen = tool generated items / reports"]
[null,null,"SWDI","SV-Bus",null,null,null,"HIQT","Hardware item Qualification testing",null,"Training Docs","Pages/Diagrams",null,"Documentation","Documentation","Pages/Diagrams","New = new and modified work\nReuse = reuse from another program or increment\nAutogen = tool generated items / reports"]
[null,null,null,"SV-Comm",null,null,null,"IT","Software/Hardware Item Integration & Test",null,"END","END",null,"Interface Requirements Specification (IRS)","Requirements","Requirements","New = new and modified work\nReuse = reuse from another program or increment\nAutogen = tool generated items / reports"]
[null,null,null,"SV-Nav",null,null,null,"SQT","System Qualification test",null,null,null,null,"Executable View","Architecture","Pages/Diagrams","New = new and modified work\nReuse = reuse from another program or increment\nAutogen = tool generated items / reports"]
[null,null,null,"SWDI",null,null,null,"Ops","Transition to Ops",null,null,null,null,"Hardware","Hardware","Pages/Diagrams","New = new and modified work\nReuse = reuse from another program or increment\nAutogen = tool generated items / reports"]
[null,null,null,null,null,null,null,"Maint","Tansition to Maintenance",null,null,null,null,"Operational Procedure","Documentation","Pages/Diagrams","New = new and modified work\nReuse = reuse from another program or increment\nAutogen = tool generated items / reports"]
[null,null,null,null,null,null,null,null,null,null,null,null,null,"Other","N/A","N/A","New = new and modified work\nReuse = reuse from another program or increment\nAutogen = tool generated items / reports"]
{"$rows_left_out":22}
{"sheet":"Sheet1","index":6,"n_rows":0,"n_cols":0,"rows_kept":0,"cut":false,"hidden":false,"merged":[]}